体外衝撃波結石破砕術実施件数
type: TerminologyConcept
description: 体外衝撃波結石破砕装置により体外（水中）で発生させた衝撃波を集束させて、これを結石に伝え破砕する治療法の実施件数。
created: 2017-12-01
broader: Ta00402
top concept of: TerminologyConceptScheme
in scheme: TerminologyConceptScheme

RDF description of 体外衝撃波結石破砕術実施件数
primary topic: 体外衝撃波結石破砕術実施件数