太陽光利用発電機器の有無
type: TerminologyConcept
description: 住宅の太陽光を利用した発電機器の有無。太陽光を利用した発電機器とは、屋根の上に乗せた集光板によって太陽光を集め、これを電力に換えて用いる機器をいう。
created: 2017-12-01
broader: Ta00569
top concept of: TerminologyConceptScheme
in scheme: TerminologyConceptScheme

RDF description of 太陽光利用発電機器の有無
primary topic: 太陽光利用発電機器の有無