RDF description of 多目的運動広場数
primary topic: 多目的運動広場数

多目的運動広場数
type: TerminologyConcept
description: 土地面積が992平方メートル以上のもので、必要に応じて各種スポーツが行えるものの数。
created: 2017-12-01
broader: Ta00407
in scheme: TerminologyConceptScheme
top concept of: TerminologyConceptScheme