他事業所の有無
type: TerminologyConcept
description: 同一企業において、当該工場とは別の場所に工場があるかどうかの別及び当該事業所が本社・本店と同一の敷地内であるかどうかの別。
created: 2017-12-01
broader: Ta00578
top concept of: TerminologyConceptScheme
in scheme: TerminologyConceptScheme

RDF description of 他事業所の有無
primary topic: 他事業所の有無