藻場・干潟の有無
type: TerminologyConcept
description: 調査期日現在における地先海面の藻場・干潟の有無。藻場とは、アマモ、ガラモ等の海藻が繁茂し、陸上の森林の様相を呈するものをいい、その面積が１ha以上のものを対象とする。干潟とは、日常干潮帯に露出する砂泥平底で、干潮時における平均的な面積が１ha以上のものを対象とする。
created: 2017-12-01
broader: Ta00614
top concept of: TerminologyConceptScheme
in scheme: TerminologyConceptScheme

RDF description of 藻場・干潟の有無
primary topic: 藻場・干潟の有無