総土地面積_2
type: TerminologyConcept
description: 所有している土地の面積。他の法人又は個人と共同で所有している場合、又は建物の一部を区分所有している場合で、そのための敷地利用権として土地の所有権を共用している場合は、当該法人の持ち分に相当する面積とする。
created: 2017-12-01
broader: Ta00202
top concept of: TerminologyConceptScheme
in scheme: TerminologyConceptScheme

RDF description of 総土地面積_2
primary topic: 総土地面積_2