総延稼動日数
type: TerminologyConcept
description: 調査対象船舶において、当該船舶に乗り込んでいる者が調査対象期間中に稼働動した総延べ日数
created: 2017-12-01
broader: Ta00354
top concept of: TerminologyConceptScheme
in scheme: TerminologyConceptScheme

RDF description of 総延稼動日数
primary topic: 総延稼動日数