船舶・車輌・運搬具・耐用年数１年以上の工具器具備品の有形固定資産の資産額
type: TerminologyConcept
description: 船舶、水上運搬具、鉄道車両、自動車、陸上運搬具及び耐用年数１年以上で１件１０万円以上の有形固定資産に属する資産の取得額。
created: 2017-12-01
broader: Ta00030
top concept of: TerminologyConceptScheme
in scheme: TerminologyConceptScheme

RDF description of 船舶・車輌・運搬具・耐用年数１年以上の工具器具備品の有形固定資産の資産額
primary topic: 船舶・車輌・運搬具・耐用年数１年以上の工具器具備品の有形固定資産の資産額