船の新馬力数適用の有無
type: TerminologyConcept
description: 11月１日現在保有する動力船が新馬力数の適用を受けた（平成14年以降に、新たに推進機関を搭載した船）か否かの別。
created: 2017-12-01
broader: Ta00655
top concept of: TerminologyConceptScheme
in scheme: TerminologyConceptScheme

RDF description of 船の新馬力数適用の有無
primary topic: 船の新馬力数適用の有無