船の10トン以上該当の有無
type: TerminologyConcept
description: 過去１年間に従事した自営漁業のうち、海上作業従事日数の最も長かった漁業種類で使用した漁船のトン数が10トン以上であるか否かの別。
created: 2017-12-01
broader: Ta00655
in scheme: TerminologyConceptScheme
top concept of: TerminologyConceptScheme

RDF description of 船の10トン以上該当の有無
primary topic: 船の10トン以上該当の有無