専修学校であるか否か
type: TerminologyConcept
description: 専修学校に通っているか否かの別。専修学校とは、学校教育法の規定に基づき、専修学校として監督官庁の認可を受けた学校をいう。
in scheme: TerminologyConceptScheme
broader: Ta00513
top concept of: TerminologyConceptScheme
created: 2017-12-01
narrower: si246010016
narrower: si329010015
narrower: si246020016
narrower: si329020015

RDF description of 専修学校であるか否か
primary topic: 専修学校であるか否か