青少年教育関係指導員数
type: TerminologyConcept
description: 教育委員会が委嘱している指導員のうち社会教育指導員及び体育指導委員以外の者の中で青少年教育関係の指導員の延べ人数。
created: 2017-12-01
broader: Ta00118
top concept of: TerminologyConceptScheme
in scheme: TerminologyConceptScheme

RDF description of 青少年教育関係指導員数
primary topic: 青少年教育関係指導員数