RDF description of 製造業出荷収入額
primary topic: 製造業出荷収入額

製造業出荷収入額
type: TerminologyConcept
in scheme: TerminologyConceptScheme
top concept of: TerminologyConceptScheme
broader: Ta00054
created: 2017-12-01
description: 自店で製造した商品を卸売している場合の卸売販売額、原材料を支給して委託生産したものに自社において加工処理をして完成させた商品の卸売販売額、及び受託製造した場合の加工賃収入額。海外への輸出額を含む。加工処理とは、完成された部分品の組み立て、製造に係わる修理、真空包装（熱処理包装を含む）等の製造工程を有するものをいう。