製材用動力数
type: TerminologyConcept
description: 製材用機械の原動力の出力数（モーター等）。製材機用だけでなく、製材に関係ある動力（例えば、目立機、巻き上げ機、ベルトコンベアーなど）の出力数も含める。
created: 2017-12-01
broader: Ta00322
in scheme: TerminologyConceptScheme
top concept of: TerminologyConceptScheme

RDF description of 製材用動力数
primary topic: 製材用動力数