精神科訪問看護・指導実施件数
type: TerminologyConcept
description: 入院外である精神障害患者又はその家族、精神障害者復帰施設等入所者等に対して、当該患者を診療した精神科を広告している保険医療機関の保健師等が訪問して行う看護及び社会復帰指導の実施件数。
created: 2017-12-01
broader: Ta00401
in scheme: TerminologyConceptScheme
top concept of: TerminologyConceptScheme

RDF description of 精神科訪問看護・指導実施件数
primary topic: 精神科訪問看護・指導実施件数