生命保険料控除額Ａ
type: TerminologyConcept
description: 本人が生命保険料控除を受けた金額。【平成24年度分から適用される生命保険料控除額の税法上の改正に伴い「一般生命保険料控除額」を新たに作成し、生命保険料控除額Ａとして設定。】
created: 2017-12-01
broader: Ta00023
top concept of: TerminologyConceptScheme
in scheme: TerminologyConceptScheme

RDF description of 生命保険料控除額Ａ
primary topic: 生命保険料控除額Ａ