生命保険・個人年金保険・損害保険・簡易保険に払い込んだ保険料の有無
type: TerminologyConcept
description: 生命保険、損害保険、簡易保険に払い込んだ保険料の有無。生命保険とは、生命保険会社の養老保険、終身保険、こども保険、個人年金保険などの生命保険、及び農業協同組合の養老生命共済、こども共済など。損害保険とは、火災保険、傷害保険のうち、満期時に満期返戻金が支払われる長期総合保険、積立生活総合保険など。簡易保険とは、郵便局で取り扱っている養老保険、家族保険、旧郵便年金である終身年金保険、定期年金保険など。掛け捨ての生命保険、火災保険、傷害保険は含まない
created: 2017-12-01
broader: Ta00557
top concept of: TerminologyConceptScheme
in scheme: TerminologyConceptScheme

RDF description of 生命保険・個人年金保険・損害保険・簡易保険に払い込んだ保険料の有無
primary topic: 生命保険・個人年金保険・損害保険・簡易保険に払い込んだ保険料の有無