RDF description of 生徒指導主事数
primary topic: 生徒指導主事数

生徒指導主事数
type: TerminologyConcept
in scheme: TerminologyConceptScheme
top concept of: TerminologyConceptScheme
broader: Ta00122
created: 2017-12-01
description: 学校教育法施行規則に基づき学校に配置される「生徒指導主事」の数。生徒指導主事は、校長の監督を受け、生徒指導に関する事項をつかさどり、当該事項について連絡調整及び指導、助言に当たる教諭である。