生産品・取扱い商品・営業種目_2
type: TerminologyConcept
narrower: si409010022
narrower: si408010021
description: 事業所で取り扱っている生産品、取扱い商品又は営業種目。収入額又は販売額の多いものである。
created: 2017-12-01
narrower: si408020024
narrower: si409020043
broader: Ta00537
top concept of: TerminologyConceptScheme
narrower: si408020043
narrower: si408010060
narrower: si456010005
narrower: si409020024
narrower: si457010026
in scheme: TerminologyConceptScheme

RDF description of 生産品・取扱い商品・営業種目_2
primary topic: 生産品・取扱い商品・営業種目_2