RDF description of 生産品・取扱い商品・営業種目_1
primary topic: 生産品・取扱い商品・営業種目_1

生産品・取扱い商品・営業種目_1
type: TerminologyConcept
in scheme: TerminologyConceptScheme
top concept of: TerminologyConceptScheme
broader: Ta00537
created: 2017-12-01
description: 事業所等で取り扱っている生産品、取扱い商品又は営業種目。収入額又は販売額の多いものである。