生産費該当生産物
type: TerminologyConcept
description: 自家で生産した農産物及び自家で生産した農産物を原料として自らが加工した加工食品を家計又は農業生産関連事業で消費した場合、並びに当該調査客体が採取した天然性採取物を農業生産関連事業で消費した場合の品名。
created: 2017-12-01
broader: Ta00601
top concept of: TerminologyConceptScheme
in scheme: TerminologyConceptScheme

RDF description of 生産費該当生産物
primary topic: 生産費該当生産物