生産数量_2
type: TerminologyConcept
description: 生産量を数量の単位（cmプライ、kmコア、グロス、セクション数、セット、ダース、デカ、羽、箇所、回、階、階建、換算箱、企業、基、機、教室、経営体、件、個、講座、施設、事業所、式、室、社、隻、組、足、体、台、挺、点、頭、鉢、発、本、枚、面、門、両など）で表したもの。生産とは、事業所及び工場において実際に製品を生産すること。製品とは、修理改造、再製品を除く最終の社内検査又は立ち会い検査を完了したものを指す。受入品（輸入品（自社他社を問わない。）を含む。）で検査のみを国内で行ったものなどは含めない。自家使用又は自己消費する目的で生産したものを含む。受託生産は含むが、委託生産は含まない。修理改造も含む。
created: 2017-12-01
broader: Ta00469
in scheme: TerminologyConceptScheme
top concept of: TerminologyConceptScheme

RDF description of 生産数量_2
primary topic: 生産数量_2