RDF description of 生産重量
primary topic: 生産重量

生産重量
type: TerminologyConcept
in scheme: TerminologyConceptScheme
top concept of: TerminologyConceptScheme
broader: Ta00283
created: 2017-12-01
description: 生産量を重量の単位（g、kg、t、鉛量t、純分換算kg、絶乾t、導体tなど）で表したもの。生産とは、事業所及び工場において実際に製品を生産すること。製品とは、修理改造、再製品を除く最終の社内検査又は立ち会い検査を完了したものを指す。受入品（輸入品（自社他社を問わない。）を含む。）で検査のみを国内で行ったものなどは含めない。自家使用又は自己消費する目的で生産したものを含む。受託生産は含むが、委託生産は含まない。