正社員・正職員数_5
type: TerminologyConcept
description: 常用雇用者（企業に常時雇用されている者（期間を定めずに雇用されている者又は１か月を超える期間を定めて雇用されている者のいずれかに該当する者）をいう。他の企業などへ出向者として送り出している者及び他の企業などから出向者として受け入れている者は、当該企業が主として給与を負担している場合は含み、そうでない場合は除く。他の企業などから派遣されている者（労働者派遣法にいう派遣労働者）は除く。）のうち、「正社員」、「正職員」として処遇している者の数。
created: 2017-12-01
broader: Ta00116
top concept of: TerminologyConceptScheme
in scheme: TerminologyConceptScheme

RDF description of 正社員・正職員数_5
primary topic: 正社員・正職員数_5