正社員・正職員数_4
type: TerminologyConcept
narrower: si408010007
narrower: si408010047
in scheme: TerminologyConceptScheme
narrower: si409020007
narrower: si408010046
narrower: si408020008
created: 2017-12-01
description: 常用雇用者（事業所に所属している従業者（他の会社など別経営の事業所へ派遣している者（労働者派遣法にいう派遣労働者）を含む。在籍出向など当該事業所に籍がありながら他の会社など別経営の事業所で働いている者は、当該事業所から一部でも給与が支払われている場合は含み、当該事業所から給与が支払われていない場合は除く。下請として当該事業所で請け負った仕事を請負先である他の会社など別経営の事業所で行っている者は除く。他の会社など別経営の事業所から派遣されている者（労働者派遣法にいう派遣労働者）は除く。在籍出向など、他の会社など別経営の事業所に籍がありながら当該事業所に来て働いている者は、別経営の事業所から一部でも給与が支払われている場合は除き、別経営の事業所から給与が支払われていない場合は含む。下請として他の会社など別経営の事業所で請け負った仕事を請負先である当該事業所に来て行っている者は除く。）のうち、常時雇用されている者（期間を定めずに雇用されている者、１か月を超える期間を定めて雇用されている者又は調査日前の２か月にそれぞれ18日以上雇用されている者のいずれかに該当する者）をいう。以上の者と同程度の賃金・給与を受けて働いている個人業主の家族を含む。重役や理事などの役員で、事務職員、労務職員を兼ねて一定の職務に就き、一般職員と同じ給与規則によって給与を受けている者を含み、それ以外の役員は除く。）のうち、一般に「正社員」、「正職員」などと呼ばれている者の数。
narrower: si408010008
narrower: si409010008
narrower: si408020007
broader: Ta00116
narrower: si457010010
narrower: si409010009
narrower: si409020008
top concept of: TerminologyConceptScheme
narrower: si457010009

RDF description of 正社員・正職員数_4
primary topic: 正社員・正職員数_4