RDF description of 整備面積
primary topic: 整備面積

整備面積
type: TerminologyConcept
in scheme: TerminologyConceptScheme
top concept of: TerminologyConceptScheme
broader: Ta00200
created: 2017-12-01
description: 上・下流の協力による森林整備去れため森林の面積。主に下流域の地方自治体が、水源林の維持等を目的として上流域の森林が所在する地方自治体等に対して森林整備費用の助成を行ったり、分収林契約等を行うなどにより整備された森林の面積。