世帯主との続き柄
type: TerminologyConcept
description: 個人の世帯主（世帯を主宰する者）から見た親族（血族、配偶者、姻族）などの関係。世帯主の決め方として、世帯の家計を主に支える者などとすることが定められている場合と、世帯の中の誰でもよい場合がある。
created: 2017-12-01
broader: Ta00501
in scheme: TerminologyConceptScheme
narrower: si323010068
narrower: si187020018
narrower: si329020017
narrower: si326020002
narrower: si187020002
narrower: si324020081
narrower: si001010002
narrower: si323020081
narrower: si001020002
narrower: si329010005
narrower: si002010002
narrower: si187010016
narrower: si246020004
narrower: si329010017
narrower: si242020047
narrower: si187010002
narrower: si329020005
narrower: si246010004
narrower: si326010002
narrower: si242010047
top concept of: TerminologyConceptScheme

RDF description of 世帯主との続き柄
primary topic: 世帯主との続き柄