RDF description of 世帯区分
primary topic: 世帯区分

世帯区分
type: TerminologyConcept
in scheme: TerminologyConceptScheme
top concept of: TerminologyConceptScheme
narrower: si242010002
narrower: si242020002
narrower: si243010001
narrower: si243020001
narrower: si246010003
narrower: si246020003
narrower: si247010003
narrower: si247020003
narrower: si323010002
narrower: si323020002
narrower: si324010002
narrower: si324020002
narrower: si325010001
narrower: si325020001
narrower: si326010001
narrower: si326020001
narrower: si327010002
narrower: si327020002
narrower: si328010002
narrower: si328020002
narrower: si329010002
narrower: si329020002
broader: Ta00552
created: 2017-12-01
description: 世帯を世帯主（名目上の世帯主ではなく、その世帯の家計上の主たる収入を得ている人をいう。）の職業によって、「勤労者世帯」（世帯主が会社、官公庁、学校、工場、商店などで雇われて勤めている世帯をいう。世帯主が社長、取締役、理事などのように、会社・団体の役員など、いわゆる使用者の立場にある世帯は含まない。）と「勤労者以外の世帯」（勤労者世帯以外の世帯をいう。例えば、世帯主が自営業者、個人経営者やいわゆる使用者側にある世帯をいう。）、さらには「勤労者以外の世帯」のうちの「無職世帯」（世帯主が無職である世帯をいう。例えば、年金、恩給、仕送り金、保険取金、財産収入等により家計を営んでいる世帯をいう。）に区分したもの。