世帯員数_5
type: TerminologyConcept
narrower: si329020003
in scheme: TerminologyConceptScheme
narrower: si325020002
narrower: si242020003
created: 2017-12-01
narrower: si325010002
narrower: si247020005
top concept of: TerminologyConceptScheme
description: 世帯を構成する世帯員の数。世帯とは、住居と生計を共にしている者の集まりである。ただし、単身の住み込みの家事手伝い及び単身の住み込みの雇人（営業上の使用人）は、雇主とは生計を別にしていても、雇主の世帯の世帯員に含む。
narrower: si324010003
narrower: si323010003
narrower: si246010028
narrower: si324020003
narrower: si247010005
narrower: si323020003
narrower: si329010003
narrower: si242010003
broader: Ta00126
narrower: si246020028

RDF description of 世帯員数_5
primary topic: 世帯員数_5