世帯の種類
type: TerminologyConcept
description: 「一般世帯」（住居と生計を共にしている人々の集まり又は一戸を構えて住んでいる単身者（これらの世帯と住居を共にする単身の住み込みの雇人については、人数に関係なく雇主の世帯に含まれる。）、これらの世帯と住居を共にし、別に生計を維持している間借りの単身者又は下宿屋などに下宿している単身者、及び会社・団体・商店・官公庁などの寄宿舎、独身寮などに居住している単身者）、「施設等の世帯」（学校の寮・寄宿舎で起居を共にし、通学している学生・生徒の棟ごとの集まり、病院・療養所などに、既に３か月以上入院している入院患者の棟ごとの集まり、老人ホーム、児童保護施設などの社会施設の入所者の棟ごとの集まり、自衛隊の営舎内又は艦船内の居住者の中隊又は艦船ごとの集まり、刑務所及び拘置所の被収容者並びに少年院及び婦人補導院の在院者の建物ごとの集まり、並びに定まった住居を持たない個々の単身者や陸上に生活の本拠（住所）を有しない個々の船舶乗組員など）の別。
created: 2017-12-01
broader: Ta00552
in scheme: TerminologyConceptScheme
narrower: si001010028
narrower: si001020025
narrower: si002010020
top concept of: TerminologyConceptScheme

RDF description of 世帯の種類
primary topic: 世帯の種類