世帯の経済的中心者か否か
type: TerminologyConcept
description: 生計を支えている者であるか否かの別。世帯の戸籍筆頭者や漁業従事者の中の中心的な働き手であるとは限らない。
created: 2017-12-01
broader: Ta00501
top concept of: TerminologyConceptScheme
in scheme: TerminologyConceptScheme

RDF description of 世帯の経済的中心者か否か
primary topic: 世帯の経済的中心者か否か