水洗トイレの有無Ａ
type: TerminologyConcept
top concept of: TerminologyConceptScheme
narrower: si329020029
created: 2017-12-01
broader: Ta00569
in scheme: TerminologyConceptScheme
narrower: si329010025
description: 住宅の水洗トイレの有無（及び箇所数並びに水洗でないトイレの箇所数）。トイレには、他の世帯と共用しているものも含む。水洗トイレとは、汚水を公共下水道に直接流す方式や自家浄化槽などで処理する方式のトイレをいう。団地などで浄化槽による汚水処理を共同で行っている場合も含む。簡易な水洗トイレ（汚水をくみ取りで処理する方式のトイレ）は、ここでいう水洗トイレには含まない。【平成20年10月1日、定義単位項目「水洗トイレの有無」の定義内容変更に伴い、平成20年9月30日までの定義を「水洗トイレの有無A」として設定。】

RDF description of 水洗トイレの有無Ａ
primary topic: 水洗トイレの有無Ａ