水産物取扱搬入量
type: TerminologyConcept
description: 他魚市場から当該魚市場に搬入された水産物の数量。輸入され国内で最初に価格形成されたものを含む。
created: 2017-12-01
broader: Ta00275
top concept of: TerminologyConceptScheme
in scheme: TerminologyConceptScheme

RDF description of 水産物取扱搬入量
primary topic: 水産物取扱搬入量