図書購入費
type: TerminologyConcept
description: 図書館、図書室、研究室又は教員室に備え付けの図書のうち単行本、辞書等の備品的性格を持つものの購入費の額。ただし、消耗品的性格を有する図書、新聞、雑誌等の購入費は含まない。
created: 2017-12-01
broader: Ta00095
top concept of: TerminologyConceptScheme
in scheme: TerminologyConceptScheme

RDF description of 図書購入費
primary topic: 図書購入費