図書館長・分館長数
type: TerminologyConcept
description: 公立図書館にあっては図書館法第１３条第１項に規定する館長の数。私立図書館については当該図書館の長の数。
created: 2017-12-01
broader: Ta00118
top concept of: TerminologyConceptScheme
in scheme: TerminologyConceptScheme

RDF description of 図書館長・分館長数
primary topic: 図書館長・分館長数