RDF description of 図書館協議会等の設置の有無
primary topic: 図書館協議会等の設置の有無

図書館協議会等の設置の有無
type: TerminologyConcept
in scheme: TerminologyConceptScheme
top concept of: TerminologyConceptScheme
broader: Ta00518
created: 2017-12-01
description: 図書館の運営に関する事項を検討するために設置される常設の審議会、委員会、協議会等の有無。