人件費_3
type: TerminologyConcept
description: 常用雇用されている現場労働者（現場施工の管理・監督に当たる技能者は除く。）を雇用するために必要な経費全般の額。完成工事について発生した経費のうち役員報酬、従業員給料手当、退職金、法定福利費及び福利厚生費の額。人材派遣にかかる費用を含み、退職給与引当金は除く。
created: 2017-12-01
broader: Ta00088
top concept of: TerminologyConceptScheme
in scheme: TerminologyConceptScheme

RDF description of 人件費_3
primary topic: 人件費_3