身長
type: TerminologyConcept
description: 人が足を揃えて直立した際の床面から頭頂までの垂直最大距離のこと。測定法は、裸足で30～40度前方開角位で直立させ、被験者の踵部、臀部及び背部の３点を尺柱に密着させ、かつ頭を正面を向かせて、耳殻上縁と眼窩下縁が水平位に並ぶ耳眼水平位で測定する。
created: 2017-12-01
broader: Ta00155
top concept of: TerminologyConceptScheme
in scheme: TerminologyConceptScheme

RDF description of 身長
primary topic: 身長