診療録管理専任従事者の有無
type: TerminologyConcept
description: 診療録の整理、疾病分類、疾病統計の作成及び患者台帳の作成等に専門に従事している者の有無。
created: 2017-12-01
broader: Ta00644
top concept of: TerminologyConceptScheme
in scheme: TerminologyConceptScheme

RDF description of 診療録管理専任従事者の有無
primary topic: 診療録管理専任従事者の有無