RDF description of 診療放射線技師の常勤換算数
primary topic: 診療放射線技師の常勤換算数

診療放射線技師の常勤換算数
type: TerminologyConcept
in scheme: TerminologyConceptScheme
top concept of: TerminologyConceptScheme
broader: Ta00119
created: 2017-12-01
description: 施設が直接雇い入れた者、派遣労働者、出向者、一般の従事者と同様の勤務状況にある家族従事者のうち、その施設で定めた１週間の勤務時間により常勤に換算した診療放射線技師の数。診療放射線技師とは、診療放射線技師の免許を有し、主として放射線診療に従事している者をいう。