RDF description of 深水管理回数
primary topic: 深水管理回数

深水管理回数
type: TerminologyConcept
description: 深水管理を行った回数。深水管理とは、田んぼに約15cmほど水を張り、稲の分けつを抑制して、その代わりに太くて丈夫な苗をじっくり育てることを目的としている。
created: 2017-12-01
broader: Ta00423
in scheme: TerminologyConceptScheme
top concept of: TerminologyConceptScheme