RDF description of 森林公園利用者数
primary topic: 森林公園利用者数

森林公園利用者数
type: TerminologyConcept
in scheme: TerminologyConceptScheme
top concept of: TerminologyConceptScheme
broader: Ta00148
created: 2017-12-01
description: 森林公園の利用者数。森林公園とは、森林空間を利用した森林浴、野外レクリエーション、自然体験学習等の場として提供されている公園をいう。