振替体積量
type: TerminologyConcept
description: 生産された石油製品の品種振替量又は再処理量を体積の単位（l、kl、m3、Nm3など）で表したもの。品種振替とは、特定の種類の石油製品を、混合、添加等の化学反応を伴わない操作や、単なる銘柄変更による転用等により他の種類の石油製品に転換すること。同一品種間の振替は相殺されるため計上しない。再処理には、在庫製品の再処理、原料油及び半製品への格下げを含む。
created: 2017-12-01
broader: Ta00250
in scheme: TerminologyConceptScheme
top concept of: TerminologyConceptScheme

RDF description of 振替体積量
primary topic: 振替体積量