RDF description of 職員数_3
primary topic: 職員数_3

職員数_3
type: TerminologyConcept
in scheme: TerminologyConceptScheme
top concept of: TerminologyConceptScheme
broader: Ta00121
created: 2017-12-01
description: 調査対象である事業所ではない事業所に本務があり、調査対象である事業所を兼務している職員の数。職員とは、事務職、現業職を問わず、公務に分類されない業務を行っている事業所（学校、病院等）の場合、公務以外の業務に従事している者も含む。当該事業所に所属している職員のうち、研修、訓練等のため、当該事業所にいない者も含む。休職者、停職者、組合専従者は除く。長期欠勤者（３か月以上）は除く。特別職の委員で非常勤の者は除く。非常勤の役員は除く。国会議員及び地方議員は除く。