RDF description of 職員数_1
primary topic: 職員数_1

職員数_1
type: TerminologyConcept
in scheme: TerminologyConceptScheme
top concept of: TerminologyConceptScheme
broader: Ta00121
created: 2017-12-01
description: 事業所に所属し、給与の支給を受けている職員の数。職員とは、事務職、現業職を問わず、公務に分類されない業務を行っている事業所（学校、病院等）の場合、公務以外の業務に従事している者も含む。別経営の民間の事業所に所属していて当該事業所に来て働いている者は除く。併任、兼務など、二つ以上の事業所に在籍している者は、本務の事業所（給与の支払われている事業所）にのみ含む。当該事業所に所属している職員のうち、研修、訓練等のため、当該事業所にいない者も含む。休職者、停職者、組合専従者は除く。長期欠勤者（３か月以上）は除く。特別職の委員で非常勤の者は除く。非常勤の役員は除く。国会議員及び地方議員は除く。