植物の取得価額・盛園価額
type: TerminologyConcept
description: 成園の取得価額。成園の取得価額がわからない場合は植物が成園に達した年までの育成価累計額。
created: 2017-12-01
broader: Ta00030
in scheme: TerminologyConceptScheme
top concept of: TerminologyConceptScheme

RDF description of 植物の取得価額・盛園価額
primary topic: 植物の取得価額・盛園価額