常用労働者数_2
type: TerminologyConcept
description: 事業所、企業等に所属している労働者のうち、期間を定めずに雇用されている者、１か月を超える期間を定めて雇用されている者又は調査月前の２か月にそれぞれ18日以上雇用されている者のいずれかに該当する者の数。個人業主の家族で、就業時間、賃金等が就業規則等により定められており、その管理及び就労の実態が他の労働者と同等である者を含む。重役や理事などの役員で、一般の労働者と同じように一定の仕事に従事し、一般の労働者と同じ給与規則によって給与を受けている者を含み、それ以外の役員は除く。船員法第１条の規定による船員は除く。出向労働者（一定期間勤務後出向元の会社に戻る条件で他の会社に出向している等の労働者）については、賃金の支払が行われている事業所の労働者として取り扱う。なお、出向元と出向先の双方で賃金が支払われている場合には、基本給又は賃金の半分以上を支払っている事業所の労働者として取り扱う。派遣労働者（労働者派遣法により他社から派遣を受けた労働者）は除く。ただし、労働者派遣事業を業としている事業所（派遣元事業所）において、他の事業所に派遣している労働者は含む。休職者や長期欠勤者のうち給与が支払われている者を含み、海外勤務者は除く。
created: 2017-12-01
broader: Ta00116
top concept of: TerminologyConceptScheme
in scheme: TerminologyConceptScheme

RDF description of 常用労働者数_2
primary topic: 常用労働者数_2