RDF description of 常用労働者が家族労働者であるかどうかの別
primary topic: 常用労働者が家族労働者であるかどうかの別

常用労働者が家族労働者であるかどうかの別
type: TerminologyConcept
description: 常用労働者が家族労働者であるかどうかの別。家族労働者とは、個人経営事業所では個人業主、法人組織事業所では実質的にその法人を代表する者（通例は社長）の配偶者、３親等以内の親族及びその配偶者をいう。
created: 2017-12-01
broader: Ta00523
in scheme: TerminologyConceptScheme
top concept of: TerminologyConceptScheme