RDF description of 常用従業者数_1
primary topic: 常用従業者数_1

常用従業者数_1
type: TerminologyConcept
in scheme: TerminologyConceptScheme
top concept of: TerminologyConceptScheme
broader: Ta00116
created: 2017-12-01
description: 事業所、企業等に所属している従業者のうち、常時業務に従事している従業者（期間を定めずに雇用されている者、１か月を超える期間を定めて雇用されている者、調査日前の２か月にそれぞれ18日以上雇用されている者、重役や理事などの役員で一定の職務に常時従事している者又は個人業主・家族従業者で常時業務に従事している者のいずれかに該当する者をいう。）の数。ただし、長期欠勤者（１か月以上）及び労働組合専従者は除く。