乗車定員数Ａ
type: TerminologyConcept
description: 当該貨物自動車に乗車することができる人員の最大数。【平成22年10月 定義内容の変更】
created: 2017-12-01
broader: Ta00138
top concept of: TerminologyConceptScheme
in scheme: TerminologyConceptScheme

RDF description of 乗車定員数Ａ
primary topic: 乗車定員数Ａ